{"text_format":"1","workbook":"xlsx","n_sheets":2,"sheets":["出力","見本"],"not_rendered":{"charts":0,"images":2,"macros":1,"external_links":0,"defined_names":0,"comments":0,"pivot_tables":0},"unopened":[],"bounds":{"document_bytes":16777216,"sheet_cells":100000,"rows_first":2000,"rows_last":500,"rows_between":2000,"halvings":0,"cell_chars":16384,"cell_head_chars":4096},"cells_cut":0,"cells_raw":0,"read":"whole","date_system":"1900"}

{"sheet":"出力","index":0,"n_rows":1323,"n_cols":19,"rows_kept":1323,"cut":false,"hidden":false,"merged":[]}
[null,"駅番号",1,2,3,4,5,6,7,8,9,10,11,12,13,14,15,16,17]
["時刻番号","時刻","東京","品川","新横浜","小田原","熱海","三島","新富士","静岡","掛川","浜松","豊橋","三河安城","名古屋","岐阜羽島","米原","京都","新大阪"]
[0,400]
[1,401]
[2,402]
[3,403]
[4,404]
[5,405]
[6,406]
[7,407]
[8,408]
[9,409]
[10,410]
[11,411]
[12,412]
[13,413]
[14,414]
[15,415]
[16,416]
[17,417]
[18,418]
[19,419]
[20,420]
[21,421]
[22,422]
[23,423]
[24,424]
[25,425]
[26,426]
[27,427]
[28,428]
[29,429]
[30,430]
[31,431]
[32,432]
[33,433]
[34,434]
[35,435]
[36,436]
[37,437]
[38,438]
[39,439]
[40,440]
[41,441]
[42,442]
[43,443]
[44,444]
[45,445]
[46,446]
[47,447]
[48,448]
[49,449]
[50,450]
[51,451]
[52,452]
[53,453]
[54,454]
[55,455]
[56,456]
[57,457]
[58,458]
[59,459]
[60,500]
[61,501]
[62,502]
[63,503]
[64,504]
[65,505]
[66,506]
[67,507]
[68,508]
[69,509]
[70,510]
[71,511]
[72,512]
[73,513]
[74,514]
[75,515]
[76,516]
[77,517]
[78,518]
[79,519]
[80,520]
[81,521]
[82,522]
[83,523]
[84,524]
[85,525]
[86,526]
[87,527]
[88,528]
[89,529]
[90,530]
[91,531]
[92,532]
[93,533]
[94,534]
[95,535]
[96,536]
[97,537]
[98,538]
[99,539]
[100,540]
[101,541]
[102,542]
[103,543]
[104,544]
[105,545]
[106,546]
[107,547]
[108,548]
[109,549]
[110,550]
[111,551]
[112,552]
[113,553]
[114,554]
[115,555]
[116,556]
[117,557]
[118,558]
[119,559]
[120,600]
[121,601]
[122,602]
[123,603]
[124,604]
[125,605]
[126,606]
[127,607]
[128,608]
[129,609]
[130,610]
[131,611]
[132,612]
[133,613]
[134,614]
[135,615]
[136,616]
[137,617]
[138,618]
[139,619]
[140,620]
[141,621]
[142,622]
[143,623]
[144,624]
[145,625]
[146,626]
[147,627]
[148,628]
[149,629]
[150,630]
[151,631]
[152,632]
[153,633]
[154,634]
[155,635]
[156,636]
[157,637]
[158,638]
[159,639]
[160,640]
[161,641]
[162,642]
[163,643]
[164,644]
[165,645]
[166,646]
[167,647]
[168,648]
[169,649]
[170,650]
[171,651]
[172,652]
[173,653]
[174,654]
[175,655]
[176,656]
[177,657]
[178,658]
[179,659]
[180,700]
[181,701]
[182,702]
[183,703]
[184,704]
[185,705]
[186,706]
[187,707]
[188,708]
[189,709]
[190,710]
[191,711]
[192,712]
[193,713]
[194,714]
[195,715]
[196,716]
[197,717]
[198,718]
[199,719]
[200,720]
[201,721]
[202,722]
[203,723]
[204,724]
[205,725]
[206,726]
[207,727]
[208,728]
[209,729]
[210,730]
[211,731]
[212,732]
[213,733]
[214,734]
[215,735]
[216,736]
[217,737]
[218,738]
[219,739]
[220,740]
[221,741]
[222,742]
[223,743]
[224,744]
[225,745]
[226,746]
[227,747]
[228,748]
[229,749]
[230,750]
[231,751]
[232,752]
[233,753]
[234,754]
[235,755]
[236,756]
[237,757]
[238,758]
[239,759]
[240,800]
[241,801]
[242,802]
[243,803]
[244,804]
[245,805]
[246,806]
[247,807]
[248,808]
[249,809]
[250,810]
[251,811]
[252,812]
[253,813]
[254,814]
[255,815]
[256,816]
[257,817]
[258,818]
[259,819]
[260,820]
[261,821]
[262,822]
[263,823]
[264,824]
[265,825]
[266,826]
[267,827]
[268,828]
[269,829]
[270,830]
[271,831]
[272,832]
[273,833]
[274,834]
[275,835]
[276,836]
[277,837]
[278,838]
[279,839]
[280,840]
[281,841]
[282,842]
[283,843]
[284,844]
[285,845]
[286,846]
[287,847]
[288,848]
[289,849]
[290,850]
[291,851]
[292,852]
[293,853]
[294,854]
[295,855]
[296,856]
[297,857]
[298,858]
[299,859]
[300,900]
[301,901]
[302,902]
[303,903]
[304,904]
[305,905]
[306,906]
[307,907]
[308,908]
[309,909]
[310,910]
[311,911]
[312,912]
[313,913]
[314,914]
[315,915]
[316,916]
[317,917]
[318,918]
[319,919]
[320,920]
[321,921]
[322,922]
[323,923]
[324,924]
[325,925]
[326,926]
[327,927]
[328,928]
[329,929]
[330,930]
[331,931]
[332,932]
[333,933]
[334,934]
[335,935]
[336,936]
[337,937]
[338,938]
[339,939]
[340,940]
[341,941]
[342,942]
[343,943]
[344,944]
[345,945]
[346,946]
[347,947]
[348,948]
[349,949]
[350,950]
[351,951]
[352,952]
[353,953]
[354,954]
[355,955]
[356,956]
[357,957]
[358,958]
[359,959]
[360,1000]
[361,1001]
[362,1002]
[363,1003]
[364,1004]
[365,1005]
[366,1006]
[367,1007]
[368,1008]
[369,1009]
[370,1010]
[371,1011]
[372,1012]
[373,1013]
[374,1014]
[375,1015]
[376,1016]
[377,1017]
[378,1018]
[379,1019]
[380,1020]
[381,1021]
[382,1022]
[383,1023]
[384,1024]
[385,1025]
[386,1026]
[387,1027]
[388,1028]
[389,1029]
[390,1030]
[391,1031]
[392,1032]
[393,1033]
[394,1034]
[395,1035]
[396,1036]
[397,1037]
{"$rows_left_out":924}
{"sheet":"見本","index":1,"n_rows":34,"n_cols":17,"rows_kept":34,"cut":false,"hidden":false,"merged":[]}
["ダイヤグラムを描画・消去する"]
[]
["開始時刻番号",1]
["終了時刻番号",15]
[]
["開始駅番号",13]
["終了駅番号",34]
[]
[]
[]
[null,"時刻番号",1,2,3,4,5,6,7,8,9,10,11,12,13,14,15]
["駅記号","駅名"]
[1,{"$f":"HLOOKUP(A13,出力!$C$1:$IV$2,2)","v":"東京"},600,"","","",616,620,"",626,630,633,"","",643,647,650]
[2,{"$f":"HLOOKUP(A14,出力!$C$1:$IV$2,2)","v":"品川"},607,600,"","",623,627,"",634,637,640,"","",651,654,657]
[3,{"$f":"HLOOKUP(A15,出力!$C$1:$IV$2,2)","v":"新横浜"},617,611,"","",633,638,"",645,648,651,"","",701,705,708]
[3,{"$f":"HLOOKUP(A16,出力!$C$1:$IV$2,2)","v":"新横浜"},618,611,600,"",634,639,"",646,649,652,"","",702,706,709]
[4,{"$f":"HLOOKUP(A17,出力!$C$1:$IV$2,2)","v":"小田原"},"","",615,"","","","",704,"",708,"","","","",""]
[5,{"$f":"HLOOKUP(A18,出力!$C$1:$IV$2,2)","v":"熱海"},"","","","","","","","","",717,"","","","",""]
[6,{"$f":"HLOOKUP(A19,出力!$C$1:$IV$2,2)","v":"三島"},"","","","","","","","","",724,"","","","",""]
[6,{"$f":"HLOOKUP(A20,出力!$C$1:$IV$2,2)","v":"三島"},"","","","","","","","","",727,"","","","",""]
[7,{"$f":"HLOOKUP(A21,出力!$C$1:$IV$2,2)","v":"新富士"},"","","","","","","","","",741,"","","","",""]
[8,{"$f":"HLOOKUP(A22,出力!$C$1:$IV$2,2)","v":"静岡"},"","",641,"","","","","","",754,"","","","",""]
[8,{"$f":"HLOOKUP(A23,出力!$C$1:$IV$2,2)","v":"静岡"},"","",642,605,"","","","","",757,"",638,"","",""]
[9,{"$f":"HLOOKUP(A24,出力!$C$1:$IV$2,2)","v":"掛川"},"","","",620,"","","","","",812,"",657,"","",""]
[10,{"$f":"HLOOKUP(A25,出力!$C$1:$IV$2,2)","v":"浜松"},"","","",631,"","","","","",823,"",708,"","",""]
[10,{"$f":"HLOOKUP(A26,出力!$C$1:$IV$2,2)","v":"浜松"},"","","",632,"","","","","",828,"",710,"","",""]
[11,{"$f":"HLOOKUP(A27,出力!$C$1:$IV$2,2)","v":"豊橋"},"","","",645,"","","",759,"",846,"",725,"","",""]
[12,{"$f":"HLOOKUP(A28,出力!$C$1:$IV$2,2)","v":"三河安城"},"","","",700,"","","","","",902,"",739,"","",""]
[13,{"$f":"HLOOKUP(A29,出力!$C$1:$IV$2,2)","v":"名古屋"},736,729,726,711,753,801,"",819,811,914,"",750,824,829,834]
[13,{"$f":"HLOOKUP(A30,出力!$C$1:$IV$2,2)","v":"名古屋"},737,730,727,712,754,802,620,821,812,"",635,756,825,831,835]
[14,{"$f":"HLOOKUP(A31,出力!$C$1:$IV$2,2)","v":"岐阜羽島"},"","","",723,"","","",834,"","",646,811,"","",""]
[15,{"$f":"HLOOKUP(A32,出力!$C$1:$IV$2,2)","v":"米原"},"","","",738,"","","",854,"","",659,831,"","",""]
[16,{"$f":"HLOOKUP(A33,出力!$C$1:$IV$2,2)","v":"京都"},812,806,802,759,830,840,656,916,849,"",720,852,902,909,913]
[17,{"$f":"HLOOKUP(A34,出力!$C$1:$IV$2,2)","v":"新大阪"},825,819,815,813,843,853,710,930,903,"",733,906,916,923,926]